Catchable Fatal Error Argument 1 Passed To

Catchable Fatal Error Argument 1 Passed to Genesis

RECOMMENDED: If you have Windows errors then we strongly recommend that you download and run this (Windows) Repair Tool.

Catchable fatal error: Argument 2 passed to Illuminate\Routing\UrlGenerator::__construct() must be an instance of Illuminate\Http\Request, null given, called in C:\xampp\htdocs\laravel52\vendor\laravel\framework\src\Illuminate\Routing.

Catchable Fatal Error: Argument 1 passed to. – Stack Overflow – My problem is now when I want to submit I get the following error: ContextErrorException: Catchable Fatal Error: Argument 1 passed to VolleyScout Let's take this error apart so you can see how to figure out error messages. ContextErrorException: Catchable Fatal Error: This is the type of the error.

Catchable Fatal Error: Argument 1 passed to DoctrineCommonCollectionsArrayCollection::__construct() must be an array, object given, called in dupa dupa <?php.

Project Build Error Unresolveable Build Extension plugins – Maven: unresolvable build extension – Stack Overflow – Jul 1, 2012. [ERROR] Unresolveable build extension: Plugin org.sonatype.flexmojos: flexmojos-maven-plugin:3.8 or one of its dependencies could not be. [tycho-user] Failed to collect dependencies. project> And here I get the following error message in Eclipse: Project build error: Unresolveable build extension:. (DefaultProjectBuilder.java:141) at org.apache.maven.project.DefaultProjectBuilder.build. [ERROR] Unresolveable build extension: Pl. Ioncube Error Secure and license PHP scripts with the new ionCube PHP Encoder 10.0. Encrypt and protect files with PHP encoding, encryption, obfuscation and licensing capabilities. If you are curious how

phpBB • Notification Settings error – Catchable fatal error: Argument 1 passed to. a complete set of files (again) manually purged the cache, and the error remains the same.

Catchable fatal error: Argument 1 passed to WikiPage::factory() must be an instance of Title, null given, called in.mw-26-00includesImport.php on line 313 and.

Connect Error 12547 Ioncube Error Secure and license PHP scripts with the new ionCube PHP Encoder 10.0. Encrypt and protect files with PHP encoding, encryption, obfuscation and licensing capabilities. If you are curious how the web hosting is working or how to manage you hosting account by yourself check our complete web hosting F.A.Q Unlimited hosting on cloud with Free domain name – WebLand.in – Reliable web shop with Unlimited hosting space, traffic etc starting from Rs 700/- year, Cheap Domain, Seo and professional web design | The reliable web shop. Aug 6,

// Attach the mock object to the cache object and listen for the results to be set on cache

Catchable fatal error: Argument 1 passed to Template::prepare() must be an instance of Page, boolean given, called in /usr/home/projects/garant-clinic.ru/html/index.php on line 27 and defined in /usr/home/projects/garant-clinic.ru/html/libraries/Gena/class.Template.php on line 105.

Catchable fatal error: Argument 1 passed to JobTransformer::transform() must be an instance of SimplePie_Item, boolean given, called in /var/www/ulteig.com-cleaned/controllers/careers/controller.php on line 41 and defined in /var/www/ulteig.com-cleaned/controllers/careers/controller.php on line 181.

I just continue to get this error when I log in… Catchable fatal error: Argument 1 passed to Genesis_Admin_CPT_Archive_Settings::__construct() must be an instance of stdClass, instance of WP_Post_Type given, called in.

WordPress 4.7.5 PL Catchable fatal error: Argument 1 passed to WPSEO_Link_Type_Classifier::contains_protocol() must be of the type array, boolean given,

i getting this error trying to custom my security firewall : "Catchable Fatal Error: Argument 4 passed to SymfonyComponentSecurityHttpFirewall.

Form Rendering > Starting in Symfony2: Course 2 (2.4+). – Give it the form variable that we passed into the template, and add a submit button:. the rendering of a template (“Catchable Fatal Error: Argument 1 passed to.

Catchable fatal error: Argument 1 passed to EC_Payment_Thankyou::thankless() must be an instance of EC_User, null given, called in /home/t2t/public_html/application/default/controllers/ProfileController.php on line 27 and defined in.

Jun 13, 2009. Catchable fatal error: Argument 1 passed to Zend_Db_Select::__construct() must be an instance of Zend_Db_Adapter_Abstract, null given,

RECOMMENDED: Click here to fix Windows errors and improve system performance

Related posts