Error Reading Package Javascript Error

try, catch, finally, throw - error handling in JavaScript

RECOMMENDED: If you have Windows errors then we strongly recommend that you download and run this (Windows) Repair Tool.

Apr 21, 2015. Linting is the process used to make sure that our files are error free. if we need to lint JavaScript, PHP, and CSS, we'll need four packages:.

Whenever I try to install any package in R on Ubuntu 14.04, I'm getting the following error: Error in readRDS(file) : error reading from connection I'd highly.

Hp Photosmart C4180 Carriage Jam Error Error falta cartucho o esta dañado hp / Error or. – Oct 19, 2012  · Arreglar de forma fácil sin herramientas, un fallo muy común en impresoras hp. Carriage Jam Error HP Photosmart C4780 – HP Support Forum – my hp photosmart c4780 all in one printer is giving a carriage jam error. I followed the instructions to clear, but problem persists. How can I fix? – 641779 error message states. "carriage jam open door, clear carriage jam, then pressok to continue" the problem for me is the printer guide –

The next time an exception is thrown, pause JavaScript execution and inspect its call stack, scope variables,

What is Meteor? Meteor is a full-stack JavaScript platform for developing modern web and mobile applications. Meteor includes a key set of technologies for building.

This is list of some Java fundamental questions and answers, which are commonly asked in a Core Java interview for Experienced Developers. As a senior and matured.

Join GitHub today. GitHub is home to. Error loading syntax file "Packages/JavaScript/JavaScript.sublime-syntax": Unable to read Packages/JavaScript/JavaScript.

C2662 Error エラー内容. error C2662: 'GetName' : 'const class Animal' から 'class Animal &' へ ' this' ポインタを変換できません。 というエラーが出たことはありませんか?このエラー. Fig07_01.cpp. d:fig07_01.cpp(14) : error C2662: 'setHour' : cannot convert 'this' pointer from 'const class Time' to 'class Time &'. Conversion loses qualifiers. I'm trying to pass an object as a reference to a function that accepts the object as a const however the compiler is throwing: error C2662: 'const int DataPacket. We have a compiler error when we connect unique_lock and one derived class from lockable_adapter and the object is const. error C2664:.

★★★ Iot Error 2 Dell Printer ★★ Fix, Clean, Repair # [ IOT ERROR 2 DELL PRINTER ] & Improve Its Performance! SPEED Up Your PC – Free Scan Now! (Recommended).

After a string of. "No Room For Error In Airspace Over Shrinking ISIS Map" is part of Aviation Week & Space Technology’s subscription package. Subscribe now.

Error Message: "There was an error reading the package. An error occurred while evaluation JavaScript for the package". "There was an error reading the package.

After installing KB4041691, package users may see an error dialog that indicates that an application. Universal Windows Platform (UWP) applications that use JavaScript and asm.js may stop working after installing KB4048953.

To activate codeRR, install the MVC Nuget package. data values that are most frequently attached to the error, for instance if most reports are related to a country’s common UI culture. Read our introductory article (LINK) for more.

So I went over and examined the Log file which gave me following errors. Error reading NuGet.config. Ask. Error occurred while restoring NuGet packages: Error.

Script Error – Here's why it happens and how to fix it – Raygun – May 28, 2015. Error' and get the most data possible from cross-domain JavaScript errors. Usually from reading user data such as cookies (quite rightly, I'm.

Dec 29, 2013. Now I can't even start Rstudio as I got R session fatal error even though my R is. package 'cwhmisc' is not available (for R version 2.15.2). In reading all these forums it appears a common theme that this has occurred.

I have the same problem, only now Preview no longer works ("You cannot use the application 'Preview' with this version of OSX" is the message I get when I try to open.

Gaming, Austria – At work, someone asked if there were any better ways to handle errors when using the async/await syntax in JavaScript. as the result or error. This is how Go works, and Lua via pcall. The file might not exist or cannot be read for some.

Error Sql Ora 06550 Fixed – ORA-01033: ORACLE initialization or shutdown in. – If you get ORA-01033: ORACLE initialization or shutdown in progress error, you still get the same ORA-01033 error: SQL> exit When trying to connect to an ORACLE user via TOAD (Quest Software) or any other means (Oracle Enterprise Manager) I simply get the error: ORA-011033: ORACLE. Hp Photosmart C4180 Carriage Jam Error Error falta cartucho o esta dañado hp / Error or. – Oct 19, 2012  · Arreglar de forma fácil sin herramientas, un fallo muy común en impresoras hp. Carriage Jam

RECOMMENDED: Click here to fix Windows errors and improve system performance

Related posts