Mysql Com H Error Expected Specifier Qualifier List Before Socket

RECOMMENDED: If you have Windows errors then we strongly recommend that you download and run this (Windows) Repair Tool.

Print Engine Error In Crystal Report My report has one main report and one sub report and we implemented Saved data selection formula in both main & sub report.We scheduled crystal report through. May 7, 2010. Problem: PeopleSoft Crystal Report was not processing and error out. Looking at the message log I noticed the following messages: Crystal. Automating SEM campaigns is a smart move, thanks to the benefits you reap. WiseFixer is a professional and advanced system optimizer tool to help users easily and conveniently fix system errors,clean registry,optimize system to speed up PC. Gender: School

missing thr_*.h header file in mysql. expected specifier-qualifier-list before 'my_mutex_t. error: expected specifier-qualifier-list before.

In one of my files (that I have been told I'm not allowed to modify) I keep getting the following error: In file included from buffer.h:1, from buffer.c:4.

PHP 5 ChangeLog Version 5.6.31 06 Jul 2017. Core: Fixed bug #73807 (Performance problem with processing post request over 2000000 chars). Fixed bug #74111 (Heap.

Canon Pixma Mp210 Error 3 Restore Printing with One-Click Setup. Download Now for Your Printer Error Code 24 Raidcall Artisteer Error Code 302. Artisteer. clicforum.fr/t356-Artisteer-Error-Code-302.htm Dec.24. raidcall-raidcall-ili-raidcall-oshibka-426-raidcall-error-426. Statistical Techniques | Statistical Mechanics The maximum number of points increased for a single day is 24. Any percentages less than one hour will be counted towards the next point. The Point System. area code, or even time zone as those charged for the federally-backed insurance. At some point, the sell side is going to have to remove this error. and June 24, How To Fix Error Codes

Complete Technical Terminology / PC / SAN / NAS /. – Complete Technical Acronyms, Glossary & Definitions for PC, SAN, NAS, QA, Testing, HDTV, Wireless, Linux, Embedded, Networks, Video, Digital, pharma, Unix, Video.

For a history of new features and bug fixes, see section D MySQL change history. For a list of currently known bugs and misfeatures, see section E Known errors and design deficiencies in MySQL. For future plans, see section F List of.

Express Helpline- Get answer of your question fast from real experts.

Error Code 24 Raidcall Artisteer Error Code 302. Artisteer. clicforum.fr/t356-Artisteer-Error-Code-302.htm Dec.24. raidcall-raidcall-ili-raidcall-oshibka-426-raidcall-error-426. Statistical Techniques | Statistical Mechanics The maximum number of points increased for a single day is 24. Any percentages less than one hour will be counted towards the next point. The Point System. area code, or even time zone as those charged for the federally-backed insurance. At some point, the sell side is going to have to remove this error. and June 24, How To Fix Error Codes 22 – error codes 22. 360 games PC games error code 22 linux. educators

. expected specifier-qualifier-list before. /var/mysql/50503/include/mysql/my_sys.h:367: error: expected specifier. 5.5 installed header file layout is.

/usr/local/include/php/ext/pcre/php_pcre.h:29:18: error: pcre.h: No such file. error: expected specifier-qualifier-list before 'pcre'. ERROR2002(HY00): Can't connect to local MySQL server through socket '/tmp/mysql.sock'(2).

Complete Technical Acronyms, Glossary & Definitions for PC, SAN, NAS, QA, Testing, HDTV, Wireless, Linux, Embedded, Networks, Video, Digital, pharma, Unix, Video.

. h files into /c/MinGW/include/mysql. error: expected specifier-qualifier-list before 'SOCKET' c:\mingw\bin\./lib/gcc/mingw32/4.5.2/././././include/mysql.

When I try and compile, I get the following error: spu/./common.h:38:. "expected specifier-qualifier-list before '*' token" error in variadic function. 1.

All data is read from the socket before the engine begins to parse messages. NET api uses proper access specifier so compiler does not. Fixed some error messages in MySQL store. clear() method on database log implementation take the session qualifier. quickfix/[file].h instead of the old quickfix/include/[file].h.

Bug List – Xamarin Bugzilla – Bcl.Build.targets – error CS0246: The type or namespace name could not be found. error : error: expected specifier-qualifier-list before 'FcFontSet', 2014-10 -15. 27218, Runtime, Build, bugzilla, NEW, —, Mono doesn't build on Windows- json.c/h, 2017-08-31. SocketException: The socket is not connected, 2017-09- 01.

RECOMMENDED: Click here to fix Windows errors and improve system performance

Related posts