Project Build Error Unresolveable Build Extension

The Extension Project - Part 1 (Setting out)

RECOMMENDED: If you have Windows errors then we strongly recommend that you download and run this (Windows) Repair Tool.

plugins – Maven: unresolvable build extension – Stack Overflow – Jul 1, 2012. [ERROR] Unresolveable build extension: Plugin org.sonatype.flexmojos: flexmojos-maven-plugin:3.8 or one of its dependencies could not be.

[tycho-user] Failed to collect dependencies. project> And here I get the following error message in Eclipse: Project build error: Unresolveable build extension:.

. (DefaultProjectBuilder.java:141) at org.apache.maven.project.DefaultProjectBuilder.build. [ERROR] Unresolveable build extension: Pl.

Ioncube Error Secure and license PHP scripts with the new ionCube PHP Encoder 10.0. Encrypt and protect files with PHP encoding, encryption, obfuscation and licensing capabilities. If you are curious how the web hosting is working or how to manage you hosting account by yourself check our complete web hosting F.A.Q Unlimited hosting on cloud with Free domain name – WebLand.in – Reliable web shop with Unlimited hosting space, traffic etc starting from Rs 700/- year, Cheap Domain, Seo and professional web design | The reliable web shop. Aug 6, 2017. Hello,

Issuu is a digital publishing platform that makes it simple to publish magazines, catalogs, newspapers, books, and more online. Easily share your publications and get.

Configuration Error Pages Theme= Default Pci Bus Driver Error Control Critical Device manager shows hidden devices for Non Plug and Play. information has critical error control on 16 kernel drivers.Do I start or stop non plug and play? Or is the critical error control the reason my pc is crawling? “If you think that Iran is not your friend and that the United States and the Zionist. installed win7 and missing Ethernet controller and PCI. controller and PCI device drivers. now Control panel giving me that my SM bus and Ethernet. Make eye contact with

[ERROR] Unresolveable build extension Hello, This is my first time working with FlexPMD. I'm trying to build it from source. It builds for about 1/2 hour while.

java – Open Daylight project build issue – Stack Overflow – May 09, 2016 · Open Daylight project build issue. [ERROR] The build could not read 1 project -> [Help 1]. Unresolveable build extension. 0.

java – Unresolveable error occured in org.mule.tools.maven. – Apr 12, 2017 · I am getting the following Error in Maven Project build error: Unresolveable build extension: Plugin org.mule.tools.maven:mule-app-maven-plugin:1.1 or one of its.

Some problems were encountered while processing the POMs: [ERROR] Unresolveable build extension: Plugin org.apache.maven.wagon:wagon-ssh:2.2 or one of its.

Aug 4, 2016. jgitver-maven-plugin – maven core extension to automatically define versions using jgitver. [ERROR] Unresolveable build extension: Plugin.

When I created a mule project with maven, I got below error: [INFO] Scanning. has 2 errors [ERROR] Unresolveable build extension: Plugin.

Connect Error 12547 Ioncube Error Secure and license PHP scripts with the new ionCube PHP Encoder 10.0. Encrypt and protect files with PHP encoding, encryption, obfuscation and licensing capabilities. If you are curious how the web hosting is working or how to manage you hosting account by yourself check our complete web hosting F.A.Q Unlimited hosting on cloud with Free domain name – WebLand.in – Reliable web shop with Unlimited hosting space, traffic etc starting from Rs 700/- year, Cheap Domain, Seo and professional web design | The reliable web shop. Aug 6,

Jul 27, 2012. I'm trying to build it from source. [ERROR] Unresolveable build extension. [ DEBUG] org.apache.maven:maven-project:jar:2.0.9:compile.

RECOMMENDED: Click here to fix Windows errors and improve system performance

Related posts